{"text_format":"2","workbook":"xlsx","n_sheets":3,"sheets":["考勤","企业管理结算","支款表"],"not_rendered":{"charts":0,"images":0,"macros":0,"external_links":0,"defined_names":3,"comments":0,"pivot_tables":0},"unopened":[],"bounds":{"document_bytes":16777216,"sheet_cells":100000,"run_cost":"one","rows_first":2000,"rows_last":500,"rows_between":2000,"halvings":0,"cell_chars":16384,"cell_head_chars":4096},"cells_cut":0,"cells_raw":0,"read":"whole","date_system":"1900"}

{"sheet":"考勤","index":0,"n_rows":199,"n_cols":50,"rows_kept":199,"cut":false,"hidden":false,"merged":[]}
[{"$nulls":8},{"$f":"SUM(I3:I199)","v":23500},{"$nulls":7},{"$f":"SUM(Q3:Q199)","v":74.6},null,{"$f":"SUM(S8:S199)","v":0}]
["序号","考勤来源","姓名","年龄","级别","类别","工种","工资","合计","月份","项目名称","用工科目","单位","包工组","组织者","负责人","日工数","包工天数","包工金额","1号","2号","3号","4号","5号","6号","7号","8号","9号","10号","11号","12号","13号","14号","15号","16号","17号","18号","19号","20号","21号","22号","23号","24号","25号","26号","27号","28号","29号","30号","31号"]
[1,"电子考勤","郝月桥",{"$nulls":4},{"$f":"VLOOKUP(C3,企业管理结算!$D:$E,2,0)","v":300},{"$f":"H3*Q3","v":8100},2,{"$nulls":6},27,null,null,"-",10,10,10,10,10,10,10,10,10,10,10,10,10,10,10,10,10,10,10,10,10,10,10,10,10,10,10,"-","-","-"]
[2,"电子考勤","李文亮",{"$nulls":4},{"$f":"VLOOKUP(C4,企业管理结算!$D:$E,2,0)","v":300},{"$f":"H4*Q4","v":6600},2,{"$nulls":6},22,null,null,"-","-","-","-","-","-",10,10,10,10,10,10,10,10,10,10,10,10,10,10,10,10,10,10,10,10,10,10,"-","-","-"]
[4,"电子考勤","秦振文",{"$nulls":4},{"$f":"VLOOKUP(C5,企业管理结算!$D:$E,2,0)","v":340},{"$f":"H5*Q5","v":1360},2,{"$nulls":6},4,null,null,"-","-","-","-","-","-","-","-","-","-","-","-","-","-","-","-","-","-","-","-","-","-","-",10,10,10,10,"-","-","-","-"]
[6,"电子考勤","杨艳彬",{"$nulls":4},{"$f":"VLOOKUP(C6,企业管理结算!$D:$E,2,0)","v":350},{"$f":"H6*Q6","v":6720},2,{"$nulls":6},19.2,null,null,"-","-","-","-","-","-","-","-","-",10,10,10,10,10,10,10,10,10,10,10,10,10,10,10,10,10,12,10,"-","-","-"]
[8,"电子考勤","杨胜利",{"$nulls":4},{"$f":"VLOOKUP(C7,企业管理结算!$D:$E,2,0)","v":300},{"$f":"H7*Q7","v":720},2,{"$nulls":6},2.4,null,null,"-","-","-","-","-","-","-","-","-","-","-","-","-","-","-","-","-","-","-","-","-","-","-","-","-","-",12,12,"-","-","-"]
[9,"电子考勤","郝月桥",{"$nulls":4},{"$f":"VLOOKUP(C8,企业管理结算!$D:$E,2,0)","v":300},0,{"$nulls":10},"-","-","-","-","-","-","-","-","-","-","-","-","-","-","-","-","-","-","-","-","-","-","-","-","-","-","-","-","-","-","-"]
[10,"电子考勤","李文亮",{"$nulls":4},{"$f":"VLOOKUP(C9,企业管理结算!$D:$E,2,0)","v":300},0,{"$nulls":10},"-","-","-","-","-","-","-","-","-","-","-","-","-","-","-","-","-","-","-","-","-","-","-","-","-","-","-","-","-","-","-"]
[11,"电子考勤","李文庆",{"$nulls":4},{"$f":"VLOOKUP(C10,企业管理结算!$D:$E,2,0)","v":290},0,{"$nulls":10},"-","-","-","-","-","-","-","-","-","-","-","-","-","-","-","-","-","-","-","-","-","-","-","-","-","-","-","-","-","-","-"]
[12,"电子考勤","秦振文",{"$nulls":4},{"$f":"VLOOKUP(C11,企业管理结算!$D:$E,2,0)","v":340},0,{"$nulls":10},"-","-","-","-","-","-","-","-","-","-","-","-","-","-","-","-","-","-","-","-","-","-","-","-","-","-","-","-","-","-","-"]
[13,"电子考勤","李文魁",{"$nulls":4},{"$f":"VLOOKUP(C12,企业管理结算!$D:$E,2,0)","v":300},0,{"$nulls":10},"-","-","-","-","-","-","-","-","-","-","-","-","-","-","-","-","-","-","-","-","-","-","-","-","-","-","-","-","-","-","-"]
[14,"电子考勤","杨艳彬",{"$nulls":4},{"$f":"VLOOKUP(C13,企业管理结算!$D:$E,2,0)","v":350},0,{"$nulls":10},"-","-","-","-","-","-","-","-","-","-","-","-","-","-","-","-","-","-","-","-","-","-","-","-","-","-","-","-","-","-","-"]
[15,"电子考勤","王胜山",{"$nulls":4},{"$f":"VLOOKUP(C14,企业管理结算!$D:$E,2,0)","v":300},0,{"$nulls":10},"-","-","-","-","-","-","-","-","-","-","-","-","-","-","-","-","-","-","-","-","-","-","-","-","-","-","-","-","-","-","-"]
[16,"电子考勤","杨胜利",{"$nulls":4},{"$f":"VLOOKUP(C15,企业管理结算!$D:$E,2,0)","v":300},0,{"$nulls":10},"-","-","-","-","-","-","-","-","-","-","-","-","-","-","-","-","-","-","-","-","-","-","-","-","-","-","-","-","-","-","-"]
[17,"电子考勤","郝月桥",{"$nulls":4},{"$f":"VLOOKUP(C16,企业管理结算!$D:$E,2,0)","v":300},0,{"$nulls":10},"-","-","-","-","-","-","-","-","-","-","-","-","-","-","-","-","-","-","-","-","-","-","-","-","-","-","-","-","-","-","-"]
[18,"电子考勤","李文亮",{"$nulls":4},{"$f":"VLOOKUP(C17,企业管理结算!$D:$E,2,0)","v":300},0,{"$nulls":10},"-","-","-","-","-","-","-","-","-","-","-","-","-","-","-","-","-","-","-","-","-","-","-","-","-","-","-","-","-","-","-"]
[19,"电子考勤","秦振文",{"$nulls":4},{"$f":"VLOOKUP(C18,企业管理结算!$D:$E,2,0)","v":340},0,{"$nulls":10},"-","-","-","-","-","-","-","-","-","-","-","-","-","-","-","-","-","-","-","-","-","-","-","-","-","-","-","-","-","-","-"]
[20,"电子考勤","杨艳彬",{"$nulls":4},{"$f":"VLOOKUP(C19,企业管理结算!$D:$E,2,0)","v":350},0,{"$nulls":10},"-","-","-","-","-","-","-","-","-","-","-","-","-","-","-","-","-","-","-","-","-","-","-","-","-","-","-","-","-","-","-"]
[21,"电子考勤","杨胜利",{"$nulls":4},{"$f":"VLOOKUP(C20,企业管理结算!$D:$E,2,0)","v":300},0,{"$nulls":10},"-","-","-","-","-","-","-","-","-","-","-","-","-","-","-","-","-","-","-","-","-","-","-","-","-","-","-","-","-","-","-"]
[22,"电子考勤","李文魁",{"$nulls":4},{"$f":"VLOOKUP(C21,企业管理结算!$D:$E,2,0)","v":300},0,{"$nulls":10},"-","-","-","-","-","-","-","-","-","-","-","-","-","-","-","-","-","-","-","-","-","-","-","-","-","-","-","-","-","-","-"]
[23,"电子考勤","王胜山",{"$nulls":4},{"$f":"VLOOKUP(C22,企业管理结算!$D:$E,2,0)","v":300},0,{"$nulls":10},"-","-","-","-","-","-","-","-","-","-","-","-","-","-","-","-","-","-","-","-","-","-","-","-","-","-","-","-","-","-","-"]
[24,"电子考勤","郝运堂",{"$nulls":4},{"$f":"VLOOKUP(C23,企业管理结算!$D:$E,2,0)","v":280},0,{"$nulls":10},"-","-","-","-","-","-","-","-","-","-","-","-","-","-","-","-","-","-","-","-","-","-","-","-","-","-","-","-","-","-","-"]
[25,"电子考勤","李新贞",{"$nulls":4},{"$f":"VLOOKUP(C24,企业管理结算!$D:$E,2,0)","v":250},0,{"$nulls":10},"-","-","-","-","-","-","-","-","-","-","-","-","-","-","-","-","-","-","-","-","-","-","-","-","-","-","-","-","-","-","-"]
[26,"电子考勤","李旺",{"$nulls":4},{"$f":"VLOOKUP(C25,企业管理结算!$D:$E,2,0)","v":250},0,{"$nulls":10},"-","-","-","-","-","-","-","-","-","-","-","-","-","-","-","-","-","-","-","-","-","-","-","-","-","-","-","-","-","-","-"]
[27,"电子考勤","王新波",{"$nulls":4},{"$f":"VLOOKUP(C26,企业管理结算!$D:$E,2,0)","v":260},0,{"$nulls":10},"-","-","-","-","-","-","-","-","-","-","-","-","-","-","-","-","-","-","-","-","-","-","-","-","-","-","-","-","-","-","-"]
[28,"电子考勤","陈彦锋",{"$nulls":4},{"$f":"VLOOKUP(C27,企业管理结算!$D:$E,2,0)","v":260},0,{"$nulls":10},"-","-","-","-","-","-","-","-","-","-","-","-","-","-","-","-","-","-","-","-","-","-","-","-","-","-","-","-","-","-","-"]
[29,"电子考勤","张仲山",{"$nulls":4},{"$f":"VLOOKUP(C28,企业管理结算!$D:$E,2,0)","v":240},0,{"$nulls":10},"-","-","-","-","-","-","-","-","-","-","-","-","-","-","-","-","-","-","-","-","-","-","-","-","-","-","-","-","-","-","-"]
[30,"电子考勤","郝月桥",{"$nulls":4},{"$f":"VLOOKUP(C29,企业管理结算!$D:$E,2,0)","v":300},0,{"$nulls":10},"-","-","-","-","-","-","-","-","-","-","-","-","-","-","-","-","-","-","-","-","-","-","-","-","-","-","-","-","-","-","-"]
[31,"电子考勤","杨艳彬",{"$nulls":4},{"$f":"VLOOKUP(C30,企业管理结算!$D:$E,2,0)","v":350},0,{"$nulls":10},"-","-","-","-","-","-","-","-","-","-","-","-","-","-","-","-","-","-","-","-","-","-","-","-","-","-","-","-","-","-","-"]
[32,"电子考勤","张仲山",{"$nulls":4},{"$f":"VLOOKUP(C31,企业管理结算!$D:$E,2,0)","v":240},0,{"$nulls":10},"-","-","-","-","-","-","-","-","-","-","-","-","-","-","-","-","-","-","-","-","-","-","-","-","-","-","-","-","-","-","-"]
[33,"电子考勤","郝月桥",{"$nulls":4},{"$f":"VLOOKUP(C32,企业管理结算!$D:$E,2,0)","v":300},0,{"$nulls":10},"-","-","-","-","-","-","-","-","-","-","-","-","-","-","-","-","-","-","-","-","-","-","-","-","-","-","-","-","-","-","-"]
[34,"电子考勤","杨艳彬",{"$nulls":4},{"$f":"VLOOKUP(C33,企业管理结算!$D:$E,2,0)","v":350},0,{"$nulls":10},"-","-","-","-","-","-","-","-","-","-","-","-","-","-","-","-","-","-","-","-","-","-","-","-","-","-","-","-","-","-","-"]
[35,"电子考勤","张仲山",{"$nulls":4},{"$f":"VLOOKUP(C34,企业管理结算!$D:$E,2,0)","v":240},0,{"$nulls":10},"-","-","-","-","-","-","-","-","-","-","-","-","-","-","-","-","-","-","-","-","-","-","-","-","-","-","-","-","-","-","-"]
[36,"电子考勤","王新波",{"$nulls":4},{"$f":"VLOOKUP(C35,企业管理结算!$D:$E,2,0)","v":260},0,{"$nulls":10},"-","-","-","-","-","-","-","-","-","-","-","-","-","-","-","-","-","-","-","-","-","-","-","-","-","-","-","-","-","-","-"]
[37,"电子考勤","陈彦锋",{"$nulls":4},{"$f":"VLOOKUP(C36,企业管理结算!$D:$E,2,0)","v":260},0,{"$nulls":10},"-","-","-","-","-","-","-","-","-","-","-","-","-","-","-","-","-","-","-","-","-","-","-","-","-","-","-","-","-","-","-"]
[38,"电子考勤","李文亮",{"$nulls":4},{"$f":"VLOOKUP(C37,企业管理结算!$D:$E,2,0)","v":300},0,{"$nulls":10},"-","-","-","-","-","-","-","-","-","-","-","-","-","-","-","-","-","-","-","-","-","-","-","-","-","-","-","-","-","-","-"]
[39,"电子考勤","李文庆",{"$nulls":4},{"$f":"VLOOKUP(C38,企业管理结算!$D:$E,2,0)","v":290},0,{"$nulls":10},"-","-","-","-","-","-","-","-","-","-","-","-","-","-","-","-","-","-","-","-","-","-","-","-","-","-","-","-","-","-","-"]
[40,"电子考勤","李文魁",{"$nulls":4},{"$f":"VLOOKUP(C39,企业管理结算!$D:$E,2,0)","v":300},0,{"$nulls":10},"-","-","-","-","-","-","-","-","-","-","-","-","-","-","-","-","-","-","-","-","-","-","-","-","-","-","-","-","-","-","-"]
[41,"电子考勤","李文亮",{"$nulls":4},{"$f":"VLOOKUP(C40,企业管理结算!$D:$E,2,0)","v":300},0,{"$nulls":10},"-","-","-","-","-","-","-","-","-","-","-","-","-","-","-","-","-","-","-","-","-","-","-","-","-","-","-","-","-","-","-"]
[42,"电子考勤","李文魁",{"$nulls":4},{"$f":"VLOOKUP(C41,企业管理结算!$D:$E,2,0)","v":300},0,{"$nulls":10},"-","-","-","-","-","-","-","-","-","-","-","-","-","-","-","-","-","-","-","-","-","-","-","-","-","-","-","-","-","-","-"]
[43,"电子考勤","郝运堂",{"$nulls":4},{"$f":"VLOOKUP(C42,企业管理结算!$D:$E,2,0)","v":280},0,{"$nulls":10},"-","-","-","-","-","-","-","-","-","-","-","-","-","-","-","-","-","-","-","-","-","-","-","-","-","-","-","-","-","-","-"]
[44,"电子考勤","李新贞",{"$nulls":4},{"$f":"VLOOKUP(C43,企业管理结算!$D:$E,2,0)","v":250},0,{"$nulls":10},"-","-","-","-","-","-","-","-","-","-","-","-","-","-","-","-","-","-","-","-","-","-","-","-","-","-","-","-","-","-","-"]
[45,"电子考勤","王胜山",{"$nulls":4},{"$f":"VLOOKUP(C44,企业管理结算!$D:$E,2,0)","v":300},0,{"$nulls":10},"-","-","-","-","-","-","-","-","-","-","-","-","-","-","-","-","-","-","-","-","-","-","-","-","-","-","-","-","-","-","-"]
[46,"电子考勤","李旺",{"$nulls":4},{"$f":"VLOOKUP(C45,企业管理结算!$D:$E,2,0)","v":250},0,{"$nulls":10},"-","-","-","-","-","-","-","-","-","-","-","-","-","-","-","-","-","-","-","-","-","-","-","-","-","-","-","-","-","-","-"]
[47,"电子考勤","杨胜利",{"$nulls":4},{"$f":"VLOOKUP(C46,企业管理结算!$D:$E,2,0)","v":300},0,{"$nulls":10},"-","-","-","-","-","-","-","-","-","-","-","-","-","-","-","-","-","-","-","-","-","-","-","-","-","-","-","-","-","-","-"]
[48,"电子考勤","王新波",{"$nulls":4},{"$f":"VLOOKUP(C47,企业管理结算!$D:$E,2,0)","v":260},0,{"$nulls":10},"-","-","-","-","-","-","-","-","-","-","-","-","-","-","-","-","-","-","-","-","-","-","-","-","-","-","-","-","-","-","-"]
[49,"电子考勤","陈彦锋",{"$nulls":4},{"$f":"VLOOKUP(C48,企业管理结算!$D:$E,2,0)","v":260},0,{"$nulls":10},"-","-","-","-","-","-","-","-","-","-","-","-","-","-","-","-","-","-","-","-","-","-","-","-","-","-","-","-","-","-","-"]
[50,"电子考勤","李文庆",{"$nulls":4},{"$f":"VLOOKUP(C49,企业管理结算!$D:$E,2,0)","v":290},0,{"$nulls":10},"-","-","-","-","-","-","-","-","-","-","-","-","-","-","-","-","-","-","-","-","-","-","-","-","-","-","-","-","-","-","-"]
[51,"电子考勤","杨艳彬",{"$nulls":4},{"$f":"VLOOKUP(C50,企业管理结算!$D:$E,2,0)","v":350},0,{"$nulls":10},"-","-","-","-","-","-","-","-","-","-","-","-","-","-","-","-","-","-","-","-","-","-","-","-","-","-","-","-","-","-","-"]
[52,"电子考勤","张仲山",{"$nulls":4},{"$f":"VLOOKUP(C51,企业管理结算!$D:$E,2,0)","v":240},0,{"$nulls":10},"-","-","-","-","-","-","-","-","-","-","-","-","-","-","-","-","-","-","-","-","-","-","-","-","-","-","-","-","-","-","-"]
[53,"电子考勤","秦振文",{"$nulls":4},{"$f":"VLOOKUP(C52,企业管理结算!$D:$E,2,0)","v":340},0,{"$nulls":10},"-","-","-","-","-","-","-","-","-","-","-","-","-","-","-","-","-","-","-","-","-","-","-","-","-","-","-","-","-","-","-"]
[54,"电子考勤","尹书臣",{"$nulls":4},{"$f":"VLOOKUP(C53,企业管理结算!$D:$E,2,0)","v":260},0,{"$nulls":10},"-","-","-","-","-","-","-","-","-","-","-","-","-","-","-","-","-","-","-","-","-","-","-","-","-","-","-","-","-","-","-"]
[55,"电子考勤","程彦彬",{"$nulls":4},{"$f":"VLOOKUP(C54,企业管理结算!$D:$E,2,0)","v":250},0,{"$nulls":10},"-","-","-","-","-","-","-","-","-","-","-","-","-","-","-","-","-","-","-","-","-","-","-","-","-","-","-","-","-","-","-"]
[56,"电子考勤","程保军",{"$nulls":4},{"$f":"VLOOKUP(C55,企业管理结算!$D:$E,2,0)","v":240},0,{"$nulls":10},"-","-","-","-","-","-","-","-","-","-","-","-","-","-","-","-","-","-","-","-","-","-","-","-","-","-","-","-","-","-","-"]
[57,"电子考勤","李桂丽",{"$nulls":4},{"$f":"VLOOKUP(C56,企业管理结算!$D:$E,2,0)","v":160},0,{"$nulls":10},"-","-","-","-","-","-","-","-","-","-","-","-","-","-","-","-","-","-","-","-","-","-","-","-","-","-","-","-","-","-","-"]
[58,"电子考勤","郝月桥",{"$nulls":4},{"$f":"VLOOKUP(C57,企业管理结算!$D:$E,2,0)","v":300},0,{"$nulls":10},"-","-","-","-","-","-","-","-","-","-","-","-","-","-","-","-","-","-","-","-","-","-","-","-","-","-","-","-","-","-","-"]
[59,"电子考勤","杨艳彬",{"$nulls":4},{"$f":"VLOOKUP(C58,企业管理结算!$D:$E,2,0)","v":350},0,{"$nulls":10},"-","-","-","-","-","-","-","-","-","-","-","-","-","-","-","-","-","-","-","-","-","-","-","-","-","-","-","-","-","-","-"]
[60,"电子考勤","张仲山",{"$nulls":4},{"$f":"VLOOKUP(C59,企业管理结算!$D:$E,2,0)","v":240},0,{"$nulls":10},"-","-","-","-","-","-","-","-","-","-","-","-","-","-","-","-","-","-","-","-","-","-","-","-","-","-","-","-","-","-","-"]
[61,"电子考勤","郝月桥",{"$nulls":4},{"$f":"VLOOKUP(C60,企业管理结算!$D:$E,2,0)","v":300},0,{"$nulls":10},"-","-","-","-","-","-","-","-","-","-","-","-","-","-","-","-","-","-","-","-","-","-","-","-","-","-","-","-","-","-","-"]
[62,"电子考勤","李文亮",{"$nulls":4},{"$f":"VLOOKUP(C61,企业管理结算!$D:$E,2,0)","v":300},0,{"$nulls":10},"-","-","-","-","-","-","-","-","-","-","-","-","-","-","-","-","-","-","-","-","-","-","-","-","-","-","-","-","-","-","-"]
[63,"电子考勤","李文庆",{"$nulls":4},{"$f":"VLOOKUP(C62,企业管理结算!$D:$E,2,0)","v":290},0,{"$nulls":10},"-","-","-","-","-","-","-","-","-","-","-","-","-","-","-","-","-","-","-","-","-","-","-","-","-","-","-","-","-","-","-"]
[64,"电子考勤","李文魁",{"$nulls":4},{"$f":"VLOOKUP(C63,企业管理结算!$D:$E,2,0)","v":300},0,{"$nulls":10},"-","-","-","-","-","-","-","-","-","-","-","-","-","-","-","-","-","-","-","-","-","-","-","-","-","-","-","-","-","-","-"]
[65,"电子考勤","杨艳彬",{"$nulls":4},{"$f":"VLOOKUP(C64,企业管理结算!$D:$E,2,0)","v":350},{"$f":"H64*Q64","v":0},{"$nulls":10},"-","-","-","-","-","-","-","-","-","-","-","-","-","-","-","-","-","-","-","-","-","-","-","-","-","-","-","-","-","-","-"]
[66,"电子考勤","张仲山",{"$nulls":4},{"$f":"VLOOKUP(C65,企业管理结算!$D:$E,2,0)","v":240},0,{"$nulls":10},"-","-","-","-","-","-","-","-","-","-","-","-","-","-","-","-","-","-","-","-","-","-","-","-","-","-","-","-","-","-","-"]
[67,"电子考勤","尹书臣",{"$nulls":4},{"$f":"VLOOKUP(C66,企业管理结算!$D:$E,2,0)","v":260},0,{"$nulls":10},"-","-","-","-","-","-","-","-","-","-","-","-","-","-","-","-","-","-","-","-","-","-","-","-","-","-","-","-","-","-","-"]
[68,"电子考勤","秦振文",{"$nulls":4},{"$f":"VLOOKUP(C67,企业管理结算!$D:$E,2,0)","v":340},0,{"$nulls":10},"-","-","-","-","-","-","-","-","-","-","-","-","-","-","-","-","-","-","-","-","-","-","-","-","-","-","-","-","-","-","-"]
[69,"电子考勤","郝运堂",{"$nulls":4},{"$f":"VLOOKUP(C68,企业管理结算!$D:$E,2,0)","v":280},0,{"$nulls":10},"-","-","-","-","-","-","-","-","-","-","-","-","-","-","-","-","-","-","-","-","-","-","-","-","-","-","-","-","-","-","-"]
[70,"电子考勤","王胜山",{"$nulls":4},{"$f":"VLOOKUP(C69,企业管理结算!$D:$E,2,0)","v":300},0,{"$nulls":10},"-","-","-","-","-","-","-","-","-","-","-","-","-","-","-","-","-","-","-","-","-","-","-","-","-","-","-","-","-","-","-"]
[71,"电子考勤","程彦彬",{"$nulls":4},{"$f":"VLOOKUP(C70,企业管理结算!$D:$E,2,0)","v":250},0,{"$nulls":10},"-","-","-","-","-","-","-","-","-","-","-","-","-","-","-","-","-","-","-","-","-","-","-","-","-","-","-","-","-","-","-"]
[72,"电子考勤","杨胜利",{"$nulls":4},{"$f":"VLOOKUP(C71,企业管理结算!$D:$E,2,0)","v":300},0,{"$nulls":10},"-","-","-","-","-","-","-","-","-","-","-","-","-","-","-","-","-","-","-","-","-","-","-","-","-","-","-","-","-","-","-"]
[73,"电子考勤","程保军",{"$nulls":4},{"$f":"VLOOKUP(C72,企业管理结算!$D:$E,2,0)","v":240},0,{"$nulls":10},"-","-","-","-","-","-","-","-","-","-","-","-","-","-","-","-","-","-","-","-","-","-","-","-","-","-","-","-","-","-","-"]
[74,"电子考勤","李桂丽",{"$nulls":4},{"$f":"VLOOKUP(C73,企业管理结算!$D:$E,2,0)","v":160},0,{"$nulls":10},"-","-","-","-","-","-","-","-","-","-","-","-","-","-","-","-","-","-","-","-","-","-","-","-","-","-","-","-","-","-","-"]
[75,"电子考勤","王新波",{"$nulls":4},{"$f":"VLOOKUP(C74,企业管理结算!$D:$E,2,0)","v":260},0,{"$nulls":10},"-","-","-","-","-","-","-","-","-","-","-","-","-","-","-","-","-","-","-","-","-","-","-","-","-","-","-","-","-","-","-"]
[76,"电子考勤","陈彦锋",{"$nulls":4},{"$f":"VLOOKUP(C75,企业管理结算!$D:$E,2,0)","v":260},0,{"$nulls":10},"-","-","-","-","-","-","-","-","-","-","-","-","-","-","-","-","-","-","-","-","-","-","-","-","-","-","-","-","-","-","-"]
[77,"电子考勤","张仲山",{"$nulls":4},{"$f":"VLOOKUP(C76,企业管理结算!$D:$E,2,0)","v":240},0,{"$nulls":10},"-","-","-","-","-","-","-","-","-","-","-","-","-","-","-","-","-","-","-","-","-","-","-","-","-","-","-","-","-","-","-"]
[78,"电子考勤","付万亭",{"$nulls":4},{"$f":"VLOOKUP(C77,企业管理结算!$D:$E,2,0)","v":270},0,{"$nulls":10},"-","-","-","-","-","-","-","-","-","-","-","-","-","-","-","-","-","-","-","-","-","-","-","-","-","-","-","-","-","-","-"]
[79,"电子考勤","王红福",{"$nulls":4},{"$f":"VLOOKUP(C78,企业管理结算!$D:$E,2,0)","v":285},0,{"$nulls":10},"-","-","-","-","-","-","-","-","-","-","-","-","-","-","-","-","-","-","-","-","-","-","-","-","-","-","-","-","-","-","-"]
[80,"电子考勤","郝月桥",{"$nulls":4},{"$f":"VLOOKUP(C79,企业管理结算!$D:$E,2,0)","v":300},0,{"$nulls":10},"-","-","-","-","-","-","-","-","-","-","-","-","-","-","-","-","-","-","-","-","-","-","-","-","-","-","-","-","-","-","-"]
[81,"电子考勤","李文亮",{"$nulls":4},{"$f":"VLOOKUP(C80,企业管理结算!$D:$E,2,0)","v":300},0,{"$nulls":10},"-","-","-","-","-","-","-","-","-","-","-","-","-","-","-","-","-","-","-","-","-","-","-","-","-","-","-","-","-","-","-"]
{"$rows_left_out":120}
{"sheet":"企业管理结算","index":1,"n_rows":30,"n_cols":38,"rows_kept":30,"cut":false,"hidden":false,"merged":[]}
[{"$nulls":17},"考勤表\n总工合计","考勤表\n包工合计","考勤表\n总工资","支款表\n支款合计","汇总表各月支款合计","支款汇总差额",{"$nulls":9},"差额","支款合计"]
[{"$nulls":17},{"$f":"考勤!Q1","v":74.6},null,{"$f":"考勤!I1","v":23500},{"$f":"支款表!H1","v":2056.47},{"$f":"U3+V3+W3+X3+Y3+Z3+AA3+AB3+AC3+AD3+AE3","v":0},{"$f":"U2-V2","v":2056.47},{"$nulls":9},{"$f":"R2-R3+S2-S3+T2-T3+U2-V2","v":2056.47}]
[{"$nulls":5},{"$f":"SUM(F5:F338)","v":74.6},{"$f":"SUM(G5:G25)","v":0},{"$f":"SUM(H5:H9780)","v":0},{"$f":"SUM(I5:I100)","v":0},{"$f":"SUM(J5:J100)","v":0},0,0,0,{"$f":"SUM(N5:N31)","v":0},{"$f":"SUM(O5:O100)","v":0},{"$f":"SUM(P5:P25)","v":0},{"$f":"SUM(Q5:Q25)","v":0},{"$f":"SUM(R5:R31)","v":74.6},{"$f":"SUM(S5:S444)","v":0},{"$f":"SUM(T5:T420)","v":23500},0,0,0,0,0,0,0,0,0,0,0,0,{"$f":"SUM(AG5:AG422)","v":23500},{"$f":"SUM(AH5:AH427)-AF3","v":0}]
["序号","备注","公司","姓名","日工资","2月","3月","4月","5月","6月","7月","8月","9月","10月","11月","12月","1月","日工数合计","包工金额\n计提奖励","总合计","3月支款","4月支款","5月支款","6月支款","7月支款","8月支款","9月支款","10月支款","11月支款","12月支款","1月支款","甲方代付未付","剩余工资","合计支款",null,"身份证号码","手机","银行卡号"]
[1,"已调工资","企业管理","郝运堂",280,{"$nulls":12},{"$f":"SUM(F5:Q5)","v":0},null,{"$f":"E5*R5","v":0},{"$nulls":12},{"$f":"T5-AH5","v":0},{"$f":"SUM(U5:AF5)","v":0},null,"132129196304242815","13623200340","6228480028330329278"]
[2,"已调工资","企业管理","李桂丽",160,{"$nulls":12},0,null,{"$f":"E6*R6","v":0},{"$nulls":12},0,0,null,"22020219700602422X","13704414219","6230520540008562574"]
[3,"已调工资","企业管理","李文魁",300,{"$nulls":12},0,null,0,{"$nulls":12},0,0,null,"132127196808051315","18348776985","6228480028213275572"]
[4,"已调工资","企业管理","李文庆",290,{"$nulls":12},0,null,0,{"$nulls":12},0,0,null,"132127197204281317","15269305926","6228481729052770073"]
[5,"已调工资","企业管理","王胜山",300,{"$nulls":12},0,null,0,{"$nulls":12},0,0,null,"132127197201121334","18830863784","6228480028238641675"]
[6,"已调工资","企业管理","杨胜利",300,2.4,{"$nulls":11},2.4,null,720,{"$nulls":12},720,0,null,"132127196805071310","15100422924","6228481729166508575"]
[7,"已调工资","企业管理","杨艳彬",350,19.2,{"$nulls":11},19.2,null,6720,{"$nulls":12},6720,0,null,"130432198910091318","15127005938","6228480028554962077"]
[8,"已调工资","企业管理","张仲山",240,{"$nulls":12},0,null,0,{"$nulls":12},0,0,null,"130425197708160350","18822534014","6228480028636574973"]
[9,null,"企业管理","陈彦锋",260,{"$nulls":12},0,null,0,{"$nulls":12},0,0,null,"130434197506165272","18630075196","6212262002010327199"]
[10,null,"企业管理","程保军",240,{"$nulls":12},0,null,0,{"$nulls":12},0,0,null,"130434197205253930","15133073234","6230521720018295774"]
[11,null,"企业管理","程彦彬",250,{"$nulls":12},0,null,0,{"$nulls":12},0,0,null,"130434197108203974","15227438259","6228481721561196619"]
[12,null,"企业管理","付万亭",270,{"$nulls":12},0,null,0,{"$nulls":12},0,0,null,"37252219650224141X","15314152328","6228481009244087573"]
[13,null,"企业管理","郝月桥",300,27,{"$nulls":11},27,null,8100,{"$nulls":12},8100,0,null,"132127197701051117",13821653212,"6228480028061965878"]
[14,null,"企业管理","贺松",310,{"$nulls":12},0,null,0,{"$nulls":12},0,0]
[15,null,"企业管理","李书章",380,{"$nulls":12},0,null,0,{"$nulls":12},0,0]
[16,null,"企业管理","李旺",250,{"$nulls":12},0,null,0,{"$nulls":12},0,0,null,"130434195708135216","18732033040","6228411724537027673"]
[17,null,"企业管理","李文亮",300,22,{"$nulls":11},22,null,6600,{"$nulls":12},6600,0,null,"132127198203021315",13920444413,"6228480028692374979"]
[18,null,"企业管理","李新贞",250,{"$nulls":12},0,null,0,{"$nulls":12},0,0,null,"130434195811135214","17182287290","6228480028634229273"]
[19,null,"企业管理","李旭朋",{"$nulls":13},0,{"$nulls":14},0,0]
[20,null,"企业管理","秦俊云",{"$nulls":13},0,{"$nulls":14},0,0]
[21,null,"企业管理","秦振文",340,4,{"$nulls":11},4,null,{"$f":"E25*R25","v":1360},{"$nulls":12},1360,0,null,"132127197807211318","13596205945","6228480028886047274"]
[22,null,"企业管理","王红福",285,{"$nulls":12},0,null,0,{"$nulls":12},0,0,null,"132127196812181315","13483066967","6228481729168037672"]
[23,null,"企业管理","王涛1",270,{"$nulls":12},0,null,0,{"$nulls":12},0,0]
[24,null,"企业管理","王新波",260,{"$nulls":12},0,null,0,{"$nulls":12},0,0,null,"130434198412125215","15630055152","6217000066029809170"]
[25,null,"企业管理","尹书臣",260,{"$nulls":12},0,null,0,{"$nulls":12},0,0,null,"132127196611130132","13785054846","6228480028881785274"]
[26,null,"企业管理","张占亮",240,{"$nulls":12},0,null,0,{"$nulls":12},0,0]

{"sheet":"支款表","index":2,"n_rows":77,"n_cols":12,"rows_kept":77,"cut":false,"hidden":false,"merged":[]}
[{"$nulls":7},{"$f":"SUBTOTAL(9,H3:H77)","v":2056.47}]
["序号","批次","类别","日期","摘要","身份证号","姓名","支款金额","编号","转账结果","凭证字号","备注"]
[1,1,"众慧建筑个税","2023-03-01","个税","132127196808051315","李文魁",750,1]
[3,1,"众慧建筑个税","2023-03-01","个税","13212719671030111X","李春喜",57.48,1]
[4,1,"众慧建筑个税","2023-03-01","个税","132129196304242815","郝运堂",150,1]
[5,1,"众慧建筑个税","2023-03-01","个税","37252219650224141X","付万亭",48.99,1]
[6,1,"众慧建筑个税","2023-03-01","个税","132127197201121334","王胜山",300,1]
[7,1,"众慧建筑个税","2023-03-01","个税","132127196805071310","杨胜利",450,1]
[8,1,"众慧建筑个税","2023-03-01","个税","130425197708160350","张仲山",300,1]
[9]
[10]
[11]
[12]
[13]
[14]
[15]
[16]
[17]
[18]
[19]
[20]
[21]
[22]
[23]
[24]
[25]
[26]
[27]
[28]
[29]
[30]
[31]
[32]
[33]
[34]
[35]
[36]
[37]
[38]
[39]
[40]
[41]
[42]
[43]
[44]
[45]
[46]
[47]
[48]
[49]
[50]
[51]
[52]
[53]
[54]
[55]
[56]
[57]
[58]
[59]
[60]
[61]
[62]
[63]
[64]
[65]
[66]
[67]
[68]
[69]
[70]
[71]
[72]
[73]
[74]
[75]
[76]